Target
Kappa-type opioid receptor
Ligand
BDBM155311
Substrate
Meas. Tech.
OPRK1 antagonist assay
Temperature
298.15±n/a K
IC50
2200±n/a nM
Comments
extracted
Citation
 Roberts, EGuerrero, MAUrbano, MRosen, H Kappa opioid ligands US Patent  US9682966 Publication Date 6/20/2017 
Target
Name:
Kappa-type opioid receptor
Synonyms:
K-OR-1 Kappa-opioid receptor (KOR) Kappa-type opioid receptor (KOR) OPIATE Kappa OPRK1 kappa opioid receptor (KOR)
Type:
G Protein-Coupled Receptor (GPCR)
Mol. Mass.:
42648.76
Organism:
Homo sapiens (Human)
Description:
P41145
Residue:
380
  
Inhibitor
Name:
BDBM155311
Synonyms:
US10118915, Compound 57 | US9682966, 57
Type:
Small organic molecule
Emp. Form.:
C18H27N3O3
Mol. Mass.:
333.4253
SMILES:
COC(=O)c1cccnc1N1CCC(NC2CCCCC2)C(O)C1
: