Target
Cytochrome P450 2C8
Ligand
BDBM190404
Substrate
US9180183, DBF
Meas. Tech.
Fluorescent High Throughput P450 Assays
Temperature
310.15±n/a K
IC50
>100000±0.0 nM
Comments
extracted
Citation
 Maj, RPattarino, FMura, EBarberis, A Phospholipid drug analogs US Patent  US9180183 Publication Date 11/10/2015 
Target
Name:
Cytochrome P450 2C8
Synonyms:
CP2C8_HUMAN CYPIIC8 P450 IIC2 P450 form 1 | S-mephenytoin 4-hydroxylase
Type:
Protein
Mol. Mass.:
55839.23
Organism:
Homo sapiens (Human)
Description:
P10632
Residue:
490
  
Inhibitor
Name:
BDBM190404
Synonyms:
US9180183, SC12
Type:
Small organic molecule
Emp. Form.:
C45H73N6O12P
Mol. Mass.:
921.0679
SMILES:
CCCCCCCCCCCC(=O)OCC(COP(O)(=O)OCCNC(=O)c1ccc(Cn2c3nc(OCCOC)nc(N)c3[nH]c2=O)cc1)OC(=O)CCCCCCCCCCC
:
Substrate
Name:
BDBM189325
Synonyms:
US9173935, DBF
Type:
Substrate
Emp. Form.:
C34H24O5
Mol. Mass.:
512.5514
SMILES:
O=C(OCc1ccccc1)c1ccccc1-c1c2ccc(OCc3ccccc3)cc2oc2cc(=O)ccc12
: