Target
E3 ubiquitin-protein ligase Mdm2
Ligand
BDBM192161
Substrate
Meas. Tech.
Fluorescence Polarization (FP) Assay
Temperature
293.15±n/a K
Ki
0.3±n/a nM
Comments
extracted
Citation
 Doemling, A p53-Mdm2 antagonists US Patent  US9187441 Publication Date 11/17/2015 
Target
Name:
E3 ubiquitin-protein ligase Mdm2
Synonyms:
Double minute 2 protein E3 ubiquitin-protein ligase Mdm2 (p53-binding protein Mdm2) Human Double Minute 2 (HDM2) MDM2-MDMX p53-Binding Protein MDM2 | p53-binding protein
Type:
Oncoprotein
Mol. Mass.:
55196.54
Organism:
Homo sapiens (Human)
Description:
Q00987
Residue:
491
  
Inhibitor
Name:
BDBM192161
Synonyms:
US9187441, 7I
Type:
Small organic molecule
Emp. Form.:
C32H38ClN3O6
Mol. Mass.:
596.114
SMILES:
CCOC(=O)c1c(C(N(Cc2ccccc2)C=O)C(=O)NC2CCCCC2)c2ccc(Cl)cc2n1C(=O)OC(C)(C)C
: