Target
E3 ubiquitin-protein ligase Mdm2
Ligand
BDBM192225
Substrate
Meas. Tech.
Fluorescence Polarization (FP) Assay
Temperature
293.15±n/a K
Ki
0.17±n/a nM
Comments
extracted
Citation
 Doemling, A p53-Mdm2 antagonists US Patent  US9187441 Publication Date 11/17/2015 
Target
Name:
E3 ubiquitin-protein ligase Mdm2
Synonyms:
Double minute 2 protein E3 ubiquitin-protein ligase Mdm2 (p53-binding protein Mdm2) Human Double Minute 2 (HDM2) MDM2-MDMX p53-Binding Protein MDM2 | p53-binding protein
Type:
Oncoprotein
Mol. Mass.:
55196.54
Organism:
Homo sapiens (Human)
Description:
Q00987
Residue:
491
  
Inhibitor
Name:
BDBM192225
Synonyms:
US9187441, 7P
Type:
Small organic molecule
Emp. Form.:
C23H21ClF3N3O4
Mol. Mass.:
495.879
SMILES:
CC(C)(C)NC(=O)C(N(Cc1cc(F)cc(F)c1F)C=O)c1c([nH]c2cc(Cl)ccc12)C(O)=O
: