Target
Bcl2-associated agonist of cell death
Ligand
BDBM50424737
Substrate
Meas. Tech.
Bak Peptide Binding Assay
pH
7.5±n/a
Temperature
298.15±n/a K
IC50
4600±n/a nM
Comments
extracted
Citation
 Chen, CHChen, ZFortanet, JGGrunenfelder, DKarki, RKato, MLaMarche, MJPerez, LBStams, TMWilliams, S 1-pyridazin-/triazin-3-yl-piper(-azine)/idine/pyrolidine derivatives and compositions thereof for inhibiting the activity of SHP2 US Patent  US10093646 Publication Date 10/9/2018 
Target
Name:
Bcl2-associated agonist of cell death
Synonyms:
BAD BBC6 Bcl-2-binding component 6 Bcl-XL/Bcl-2-associated death promoter Bcl2-L-8 | Bcl2-antagonist of cell death (BAD)
Type:
PROTEIN
Mol. Mass.:
18393.69
Organism:
Homo sapiens (Human)
Description:
ChEMBL_478760
Residue:
168
  
Inhibitor
Name:
BDBM50424737
Synonyms:
CHEMBL2314519 US10844032, Example 21
Type:
Small organic molecule
Emp. Form.:
C22H18O4
Mol. Mass.:
346.3759
SMILES:
OC(=O)c1oc2ccccc2c1CCCOc1cccc2ccccc12
: