Target
Leucine-rich repeat serine/threonine-protein kinase 2
Ligand
BDBM196817
Substrate
Meas. Tech.
Lanthascreen Binding Assay
Ki
44.4±n/a nM
Citation
 Baker-Glenn, CChan, BKDotson, JEstrada, AHeffron, TLyssikatos, JSweeney, Z Bicyclic pyrazole LRRK2 small molecule inhibitors US Patent  US9212186 Publication Date 12/15/2015 
Target
Name:
Leucine-rich repeat serine/threonine-protein kinase 2
Synonyms:
Dardarin LRRK2_HUMAN Leucine-rich repeat serine/threonine-protein kinase 2 PARK8
Type:
Protein
Mol. Mass.:
286113.20
Organism:
Homo sapiens (Human)
Description:
Q5S007
Residue:
2527
  
Inhibitor
Name:
BDBM196817
Synonyms:
US9212186, 10
Type:
Small organic molecule
Emp. Form.:
C16H20F3N7
Mol. Mass.:
367.3721
SMILES:
C[C@H]1N(C)CCn2ncc(Nc3ncc(c(NC4CC4)n3)C(F)(F)F)c12
: