Target
Leucine-rich repeat serine/threonine-protein kinase 2
Ligand
BDBM50448123
Substrate
Meas. Tech.
Lanthascreen Binding Assay
Ki
279±n/a nM
Citation
 Baker-Glenn, CChan, BKDotson, JEstrada, AHeffron, TLyssikatos, JSweeney, Z Bicyclic pyrazole LRRK2 small molecule inhibitors US Patent  US9212186 Publication Date 12/15/2015 
Target
Name:
Leucine-rich repeat serine/threonine-protein kinase 2
Synonyms:
Dardarin LRRK2_HUMAN Leucine-rich repeat serine/threonine-protein kinase 2 PARK8
Type:
Protein
Mol. Mass.:
286113.20
Organism:
Homo sapiens (Human)
Description:
Q5S007
Residue:
2527
  
Inhibitor
Name:
BDBM50448123
Synonyms:
CHEMBL3122108 | US9212186, 16
Type:
Small organic molecule
Emp. Form.:
C13H15F3N6O
Mol. Mass.:
328.293
SMILES:
CNc1nc(Nc2cnn3CCOC(C)c23)ncc1C(F)(F)F
: