Target
F420-dependent glucose-6-phosphate dehydrogenase [W44A]
Ligand
BDBM197174
Substrate
Meas. Tech.
Fluorescence Binding Assay
pH
7±n/a
Kd
1.4e+4± 2e+3 nM
Comments
extracted
Citation
 Oyugi, MABashiri, GBaker, ENJohnson-Winters, K Investigating the Reaction Mechanism of F420-Dependent Glucose-6-phosphate Dehydrogenase from Mycobacterium tuberculosis: Kinetic Analysis of the Wild-Type and Mutant Enzymes. Biochemistry 55:5566-5577 (2016)  
Target
Name:
F420-dependent glucose-6-phosphate dehydrogenase [W44A]
Synonyms:
F420-dependent glucose-6-phosphate dehydrogenase mutant (FGD W44A) fgd | fgd1
Type:
Protein
Mol. Mass.:
36866.23
Organism:
Mycobacterium tuberculosis
Description:
P9WNE0[W44A]
Residue:
336
  
Inhibitor
Name:
BDBM197174
Synonyms:
Glucose-6-phosphate (G6P)
Type:
Small organic molecule
Emp. Form.:
C6H13O9P
Mol. Mass.:
260.1358
SMILES:
O[C@H](COP(O)(O)=O)[C@H](O)[C@H](O)[C@@H](O)C=O
: