Target
F420-dependent glucose-6-phosphate dehydrogenase [W44A]
Ligand
BDBM197175
Substrate
Meas. Tech.
Fluorescence Binding Assay
pH
7±n/a
Kd
120±30 nM
Comments
extracted
Citation
 Oyugi, MABashiri, GBaker, ENJohnson-Winters, K Investigating the Reaction Mechanism of F420-Dependent Glucose-6-phosphate Dehydrogenase from Mycobacterium tuberculosis: Kinetic Analysis of the Wild-Type and Mutant Enzymes. Biochemistry 55:5566-5577 (2016)  
Target
Name:
F420-dependent glucose-6-phosphate dehydrogenase [W44A]
Synonyms:
F420-dependent glucose-6-phosphate dehydrogenase mutant (FGD W44A) fgd | fgd1
Type:
Protein
Mol. Mass.:
36866.23
Organism:
Mycobacterium tuberculosis
Description:
P9WNE0[W44A]
Residue:
336
  
Inhibitor
Name:
BDBM197175
Synonyms:
F420
Type:
Small organic molecule
Emp. Form.:
C29H36N5O18P
Mol. Mass.:
773.5926
SMILES:
C[C@H](OP(O)(=O)OC[C@@H](O)[C@@H](O)[C@@H](O)Cn1c2cc(=O)ccc2cc2c1[nH]c(=O)[nH]c2=O)C(=O)N[C@@H](CCC(=O)N[C@@H](CCC(O)=O)C(O)=O)C(O)=O
: