Target
Serine/threonine-protein kinase WNK2 [166-489]
Ligand
BDBM207990
Substrate
Meas. Tech.
WNK In Vitro Radiometric Assays
pH
7.3±n/a
IC50
50±n/a nM
Comments
extracted
Citation
 Yamada, KZhang, JHXie, XReinhardt, JXie, AQLaSala, DKohls, DYowe, DBurdick, DYoshisue, HWakai, HSchmidt, IGunawan, JYasoshima, KYue, QKKato, MMogi, MIdamakanti, NKreder, NDrueckes, PPandey, PKawanami, THuang, WYagi, YIDeng, ZPark, HM Discovery and Characterization of Allosteric WNK Kinase Inhibitors. ACS Chem Biol 11:3338-3346 (2016)  
Target
Name:
Serine/threonine-protein kinase WNK2 [166-489]
Synonyms:
KIAA1760 SDCCAG43 WNK2_HUMAN | With-No-Lysine kinase 2 (WNK2)
Type:
Protein
Mol. Mass.:
37413.16
Organism:
Homo sapiens (Human)
Description:
WNK2 truncation (166-489 aa)
Residue:
324
  
Inhibitor
Name:
BDBM207990
Synonyms:
(2-((4-Chlorobenzyl)oxy)phenyl)(5-(2-(methylamino)thiazol-4-yl)indolin-1-yl)methanone (Compound 2)
Type:
Small organic molecule
Emp. Form.:
C26H22ClN3O2S
Mol. Mass.:
475.99
SMILES:
CNc1nc(cs1)-c1ccc2N(CCc2c1)C(=O)c1ccccc1OCc1ccc(Cl)cc1
: