Target
Vascular endothelial growth factor receptor 2
Ligand
BDBM5833
Substrate
biotinylated synthetic peptide
Meas. Tech.
Homogeneous Time-resolved Fluorescence (HTRF) Assay
pH
7.5±n/a
Temperature
295.15±n/a K
IC50
2±n/a nM
Citation
 Sammond, DMNailor, KEVeal, JMNolte, RTWang, LKnick, VBRudolph, SKTruesdale, ATNartey, ENStafford, JAKumar, RCheung, M Discovery of a novel and potent series of dianilinopyrimidineurea and urea isostere inhibitors of VEGFR2 tyrosine kinase. Bioorg Med Chem Lett 15:3519-23 (2005)  
Target
Name:
Vascular endothelial growth factor receptor 2
Synonyms:
CD_antigen=CD309 Fetal liver kinase 1 (FLK-1) KDR Protein-tyrosine kinase receptor Flk-1 VEGFR-2 VEGFR2 Vascular Endothelial Growth Factor Receptor Kinase 2 Vascular endothelial growth factor receptor 2 (KDR) Vascular endothelial growth factor receptor 2 (VEGFR2) Vascular endothelial growth factor receptor-2 (VEGFR-2)
Type:
Receptor Tyrosine Kinase
Mol. Mass.:
151510.97
Organism:
Homo sapiens (Human)
Description:
P35968
Residue:
1356
  
Inhibitor
Name:
BDBM5833
Synonyms:
3-{4-[methyl({2-[(4-sulfamoylphenyl)amino]pyrimidin-4-yl})amino]phenyl}-1-[4-(trifluoromethoxy)phenyl]urea | urea deriv. 24
Type:
Small organic molecule
Emp. Form.:
C25H22F3N7O4S
Mol. Mass.:
573.547
SMILES:
CN(c1ccc(NC(=O)Nc2ccc(OC(F)(F)F)cc2)cc1)c1ccnc(Nc2ccc(cc2)S(N)(=O)=O)n1
:
Substrate
Name:
biotinylated synthetic peptide
Synonyms:
Type:
Peptide
Mol. Mass.:
3433.86
Organism:
Description:
75 uM ATP as co-substrate.
Residue:
28