Target
Lysine-specific histone demethylase 1A
Ligand
BDBM289889
Substrate
Meas. Tech.
In Vitro Enzyme Inhibition Assay
Temperature
298.15±n/a K
IC50
<100±n/a nM
Comments
extracted
Citation
 Chen, YKKanouni, TKaldor, SWStafford, JAVeal, JM Inhibitors of lysine specific demethylase-1 US Patent  US9573930 Publication Date 2/21/2017 
Target
Name:
Lysine-specific histone demethylase 1A
Synonyms:
AOF2 Flavin-containing amine oxidase domain-containing protein 2 KDM1A KIAA0601 Lysine-specific demethylase 1 (LSD1) Lysine-specific histone demethylase 1 (LSD1)
Type:
Enzyme
Mol. Mass.:
92901.01
Organism:
Homo sapiens (Human)
Description:
O60341
Residue:
852
  
Inhibitor
Name:
BDBM289889
Synonyms:
4-[2-(4-amino-4-methyl-piperidin- 1-yl)-5-(3-fluoro-4-methoxy- phenyl)-1-methyl-6-oxo-1,6- dihydro-pyrimidin-4-yl]-2- fluoro-benzonitrile US10328077, Example 32 US10849898, Example 32 US11084793, Example 32 US9771329, Example 32 | US9776974, Example 32
Type:
Small organic molecule
Emp. Form.:
C25H25F2N5O2
Mol. Mass.:
465.4951
SMILES:
COc1ccc(cc1F)-c1c(nc(N2CCC(C)(N)CC2)n(C)c1=O)-c1ccc(C#N)c(F)c1
: