Target
Lysine-specific histone demethylase 1A
Ligand
BDBM283260
Substrate
Meas. Tech.
In Vitro Enzyme Inhibition Assay
Temperature
298.15±n/a K
IC50
<100±n/a nM
Comments
extracted
Citation
 Chen, YKKanouni, TKaldor, SWStafford, JAVeal, JM Inhibitors of lysine specific demethylase-1 US Patent  US9573930 Publication Date 2/21/2017 
Target
Name:
Lysine-specific histone demethylase 1A
Synonyms:
AOF2 Flavin-containing amine oxidase domain-containing protein 2 KDM1A KIAA0601 Lysine-specific demethylase 1 (LSD1) Lysine-specific histone demethylase 1 (LSD1)
Type:
Enzyme
Mol. Mass.:
92901.01
Organism:
Homo sapiens (Human)
Description:
O60341
Residue:
852
  
Inhibitor
Name:
BDBM283260
Synonyms:
4-{5-(3-fluoro-4-methoxy-phenyl)- 1-methyl-6-oxo-2-[(3S)-(pyrrolidin- 3-ylmethyl)-amino]-1,6-dihydro- pyrimidin-4-yl}-benzonitrile US10207999, Example 44 US10548896, Example 44 US10960005, Example 44 US9573930, Example 44 US9776974, Example 44
Type:
Small organic molecule
Emp. Form.:
C24H24FN5O2
Mol. Mass.:
433.4781
SMILES:
COc1ccc(cc1F)-c1c(nc(NC[C@H]2CCNC2)n(C)c1=O)-c1ccc(cc1)C#N
: