Target
Tyrosine-protein kinase ITK/TSK
Ligand
BDBM209866
Substrate
Meas. Tech.
JAK Enzyme Assay
pH
7.4±n/a
Temperature
298.15±n/a K
IC50
8510±0 nM
Comments
extracted
Citation
 Telliez, JBDowty, MEWang, LJussif, JLin, TLi, LMoy, EBalbo, PLi, WZhao, YCrouse, KDickinson, CSymanowicz, PHegen, MBanker, MEVincent, FUnwalla, RLiang, SGilbert, AMBrown, MFHayward, MMontgomery, JYang, XBauman, JTrujillo, JICasimiro-Garcia, AVajdos, FFLeung, LGeoghegan, KFQuazi, AXuan, DJones, LHett, EWright, KClark, JDThorarensen, A Discovery of a JAK3-Selective Inhibitor: Functional Differentiation of JAK3-Selective Inhibition over pan-JAK or JAK1-Selective Inhibition. ACS Chem Biol 11:3442-3451 (2016)  
Target
Name:
Tyrosine-protein kinase ITK/TSK
Synonyms:
EMT ITK_HUMAN LYK Tyrosine-protein kinase ITK Tyrosine-protein kinase Lyk
Type:
Protein
Mol. Mass.:
71839.20
Organism:
Homo sapiens (Human)
Description:
Q08881
Residue:
620
  
Inhibitor
Name:
BDBM209866
Synonyms:
PF-06651600 US20230348487, Example PF-06651600 | US9617258, Example 5
Type:
Small organic molecule
Emp. Form.:
C15H19N5O
Mol. Mass.:
285.3443
SMILES:
C[C@H]1CC[C@H](CN1C(=O)C=C)Nc1ncnc2[nH]ccc12
: