Target
Receptor tyrosine-protein kinase erbB-4
Ligand
BDBM209866
Substrate
Meas. Tech.
JAK Enzyme Assay
pH
7.4±n/a
Temperature
298.15±n/a K
IC50
25200±0 nM
Comments
extracted
Citation
 Telliez, JBDowty, MEWang, LJussif, JLin, TLi, LMoy, EBalbo, PLi, WZhao, YCrouse, KDickinson, CSymanowicz, PHegen, MBanker, MEVincent, FUnwalla, RLiang, SGilbert, AMBrown, MFHayward, MMontgomery, JYang, XBauman, JTrujillo, JICasimiro-Garcia, AVajdos, FFLeung, LGeoghegan, KFQuazi, AXuan, DJones, LHett, EWright, KClark, JDThorarensen, A Discovery of a JAK3-Selective Inhibitor: Functional Differentiation of JAK3-Selective Inhibition over pan-JAK or JAK1-Selective Inhibition. ACS Chem Biol 11:3442-3451 (2016)  
Target
Name:
Receptor tyrosine-protein kinase erbB-4
Synonyms:
ERBB4 Epidermal growth factor receptor ErbB-4 (HER4) Tyrosine Kinase Proto-oncogene c-ErbB-4 Receptor protein-tyrosine kinase erbB-4 Tyrosine kinase-type cell surface receptor HER4 (HER4)
Type:
Protein
Mol. Mass.:
146803.56
Organism:
Homo sapiens (Human)
Description:
Q15303
Residue:
1308
  
Inhibitor
Name:
BDBM209866
Synonyms:
PF-06651600 US20230348487, Example PF-06651600 | US9617258, Example 5
Type:
Small organic molecule
Emp. Form.:
C15H19N5O
Mol. Mass.:
285.3443
SMILES:
C[C@H]1CC[C@H](CN1C(=O)C=C)Nc1ncnc2[nH]ccc12
: