Target
Prostaglandin E2 receptor EP3 subtype
Ligand
BDBM50095296
Substrate
Meas. Tech.
EP3 Radioligand SPA Binding Assay
pH
7.4±n/a
Temperature
298.15±n/a K
Ki
2±n/a nM
Comments
extracted
Citation
 Bahnck, KBEdmonds, DJFutatsugi, KLee, ECMathiowetz, AMMenhaji-Klotz, EStanton, RV Antagonists of prostaglandin EP3 receptor US Patent  US9278953 Publication Date 3/8/2016 
Target
Name:
Prostaglandin E2 receptor EP3 subtype
Synonyms:
PE2R3_HUMAN PGE2-R Prostaglandin E2 receptor Prostaglandin E2 receptor EP3 subtype (EP3) Prostaglandin E2 receptor EP3D subtype (EP3D) | Prostanoid EP3 receptor
Type:
Enzyme
Mol. Mass.:
43335.03
Organism:
Homo sapiens (Human)
Description:
P43115
Residue:
390
  
Inhibitor
Name:
BDBM50095296
Synonyms:
CHEMBL3589082 | US9278953, 1
Type:
Small organic molecule
Emp. Form.:
C20H21FN4O2
Mol. Mass.:
368.4047
SMILES:
CCn1ncc2c(F)cc(cc12)-c1ccc(c(=O)[nH]1)[C@@]1(C)CCCNC1=O
: