Target
ATP-dependent DNA helicase DinG
Ligand
BDBM213233
Substrate
TP-G4
Meas. Tech.
Helicase Assays
pH
8±n/a
IC50
1.5±0.4 nM
Comments
extracted
Citation
 Bharti, SKSommers, JAGeorge, FKuper, JHamon, FShin-ya, KTeulade-Fichou, MPKisker, CBrosh, RM Specialization among iron-sulfur cluster helicases to resolve G-quadruplex DNA structures that threaten genomic stability. J Biol Chem 288:28217-29 (2013)  
Target
Name:
ATP-dependent DNA helicase DinG
Synonyms:
DING_ECOLI dinG | rarB
Type:
Protein
Mol. Mass.:
81449.89
Organism:
Escherichia coli (Enterobacteria)
Description:
P27296
Residue:
716
  
Inhibitor
Name:
BDBM213233
Synonyms:
Telomestatin (TMS)
Type:
Small organic molecule
Emp. Form.:
C26H14N8O7S
Mol. Mass.:
582.504
SMILES:
[H]C12CSC(=N1)c1coc(n1)-c1coc(n1)-c1coc(n1)-c1coc(n1)-c1coc(n1)-c1nc(oc1C)-c1nc2oc1C
:
Substrate
Name:
TP-G4
Synonyms:
Type:
DNA
Mol. Mass.:
3656.91
Organism:
Description:
G4 DNA substrate
Residue:
49