Target
ATP-dependent DNA helicase DinG
Ligand
BDBM50107609
Substrate
OX-1-G2'
Meas. Tech.
Helicase Assays
pH
8±n/a
IC50
1200±50 nM
Comments
extracted
Citation
 Bharti, SKSommers, JAGeorge, FKuper, JHamon, FShin-ya, KTeulade-Fichou, MPKisker, CBrosh, RM Specialization among iron-sulfur cluster helicases to resolve G-quadruplex DNA structures that threaten genomic stability. J Biol Chem 288:28217-29 (2013)  
Target
Name:
ATP-dependent DNA helicase DinG
Synonyms:
DING_ECOLI dinG | rarB
Type:
Protein
Mol. Mass.:
81449.89
Organism:
Escherichia coli (Enterobacteria)
Description:
P27296
Residue:
716
  
Inhibitor
Name:
BDBM50107609
Synonyms:
5,10,15,20-tetra(1-methyl-4-pyridyl)-porphyrin CHEMBL337559 | TMPyP4
Type:
Small organic molecule
Emp. Form.:
C44H38N8
Mol. Mass.:
678.8239
SMILES:
C[n+]1ccc(cc1)-c1c2ccc(n2)c(-c2cc[n+](C)cc2)c2ccc([nH]2)c(-c2cc[n+](C)cc2)c2ccc([nH]2)c(-c2cc[n+](C)cc2)c2ccc1n2
:
Substrate
Name:
OX-1-G2'
Synonyms:
Type:
DNA
Mol. Mass.:
2700.87
Organism:
Description:
G4 DNA substrate
Residue:
32