Target
Carbonic anhydrase 2
Ligand
BDBM222435
Substrate
Meas. Tech.
Carbonic Anhydrase II Kinetic Assay
pH
7.4±n/a
Ki
1.78e+3±n/a nM
Comments
extracted
Citation
 Iqbal, SSaleem, MAzim, MKTaha, MSalar, UKhan, KMPerveen, SChoudhary, MI Carbohydrazones as new class of carbonic anhydrase inhibitors: Synthesis, kinetics, and ligand docking studies. Bioorg Chem 72:89-101 (2017)  
Target
Name:
Carbonic anhydrase 2
Synonyms:
CA2 Carbonic anhydrase Carbonic anhydrase II Carbonic anhydrase II (CA-II)
Type:
Enzyme Catalytic Domain
Mol. Mass.:
29115.93
Organism:
Bos taurus
Description:
Residue:
260
  
Inhibitor
Name:
BDBM222435
Synonyms:
N'',N'''-Bis[(E)-(2,6-dichlorophenyl)methylidene]carbonic dihydrazide (9)
Type:
Small organic molecule
Emp. Form.:
C15H10Cl4N4O
Mol. Mass.:
404.078
SMILES:
Clc1cccc(Cl)c1\C=N\NC(=O)N\N=C\c1c(Cl)cccc1Cl
: