Target
26S proteasome non-ATPase regulatory subunit 14
Ligand
BDBM224013
Substrate
Meas. Tech.
In Vitro Rpn11 Activity Assay
pH
7.5±0
Temperature
303.15±0 K
IC50
2.4e+3±n/a nM
Citation
 Li, JYakushi, TParlati, FMackinnon, ALPerez, CMa, YCarter, KPColayco, SMagnuson, GBrown, BNguyen, KVasile, SSuyama, ESmith, LHSergienko, EPinkerton, ABChung, TDYPalmer, AEPass, IHess, SCohen, SMDeshaies, RJ Capzimin is a potent and specific inhibitor of proteasome isopeptidase Rpn11. Nat Chem Biol 13:486-493 (2017)  
Target
Name:
26S proteasome non-ATPase regulatory subunit 14
Synonyms:
26S Proteasome regulatory subunit Rpn11 (Rpn11) PSDE_HUMAN PSMD14 protein
Type:
Protein
Mol. Mass.:
34576.68
Organism:
Homo sapiens (Human)
Description:
O00487
Residue:
310
  
Inhibitor
Name:
BDBM224013
Synonyms:
8-Mercaptoquinoline (8TQ) | US10005735, Example 8TQ
Type:
Small organic molecule
Emp. Form.:
C9H7NS
Mol. Mass.:
161.224
SMILES:
Sc1cccc2cccnc12
: