Target
N-acylethanolamine-hydrolyzing acid amidase
Ligand
BDBM50032453
Substrate
Meas. Tech.
Enzymatic Assay
pH
7.4±n/a
IC50
23±n/a nM
Comments
extracted
Citation
 Piomelli, DBandiera, TMor, MTarzia, GBertozzi, FPonzano, S Disubstituted beta-lactones as inhibitors of N-acylethanolamine acid amidase (NAAA) US Patent  US9353075 Publication Date 5/31/2016 
Target
Name:
N-acylethanolamine-hydrolyzing acid amidase
Synonyms:
ASAH-like protein N-acylethanolamine acid amidase (NAAA) N-acylethanolamine-hydrolyzing acid amidase (NAAA) N-acylethanolamine-hydrolyzing acid amidase subunit beta NAAA_RAT | Naaa
Type:
Enzyme
Mol. Mass.:
40306.53
Organism:
Rattus norvegicus (Rat)
Description:
Q5KTC7
Residue:
362
  
Inhibitor
Name:
BDBM50032453
Synonyms:
CHEMBL3354148 | US9353075, 46
Type:
Small organic molecule
Emp. Form.:
C18H23NO5
Mol. Mass.:
333.3789
SMILES:
C[C@@H]1OC(=O)[C@@H]1NC(=O)OCc1ccc(OC2CCCCC2)cc1
: