Target
Mitotic checkpoint serine/threonine-protein kinase BUB1 [704-1085]
Ligand
BDBM162101
Substrate
Meas. Tech.
Bub1 Kinase Assay
pH
8±n/a
IC50
>20000±n/a nM
Comments
extracted
Citation
 Bärfacker, LPrechtl, SSiemeister, GWengner, AMAckerstaff, JNowak-Reppel, KBader, BLienau, PStöckigt, DHeinrich, T Amino-substituted isothiazoles US Patent  US9682995 Publication Date 6/20/2017 
Target
Name:
Mitotic checkpoint serine/threonine-protein kinase BUB1 [704-1085]
Synonyms:
BUB1 BUB1_HUMAN | Mitotic checkpoint serine/threonine-protein kinase BUB1 (aa 704-1085)
Type:
Mol. Mass.:
43624.72
Organism:
Homo sapiens (Human)
Description:
O43683[704-1085]
Residue:
382
  
Inhibitor
Name:
BDBM162101
Synonyms:
US9682995, 20
Type:
Small organic molecule
Emp. Form.:
C21H18FN5OS
Mol. Mass.:
407.464
SMILES:
CCc1ccccc1NC(=O)c1c(C)nsc1Nc1cnc2cc(F)ccc2n1
: