Target
Mitotic checkpoint serine/threonine-protein kinase BUB1 [704-1085]
Ligand
BDBM162114
Substrate
Meas. Tech.
Bub1 Kinase Assay
pH
8±n/a
IC50
>20000±n/a nM
Comments
extracted
Citation
 Bärfacker, LPrechtl, SSiemeister, GWengner, AMAckerstaff, JNowak-Reppel, KBader, BLienau, PStöckigt, DHeinrich, T Amino-substituted isothiazoles US Patent  US9682995 Publication Date 6/20/2017 
Target
Name:
Mitotic checkpoint serine/threonine-protein kinase BUB1 [704-1085]
Synonyms:
BUB1 BUB1_HUMAN | Mitotic checkpoint serine/threonine-protein kinase BUB1 (aa 704-1085)
Type:
Mol. Mass.:
43624.72
Organism:
Homo sapiens (Human)
Description:
O43683[704-1085]
Residue:
382
  
Inhibitor
Name:
BDBM162114
Synonyms:
US9682995, 29
Type:
Small organic molecule
Emp. Form.:
C17H17N5O4S2
Mol. Mass.:
419.478
SMILES:
CCOC(=O)c1cnc(Nc2snc(C)c2C(=O)Nc2ccc(OC)nc2)s1
: