Target
Dual specificity protein kinase TTK
Ligand
BDBM162179
Substrate
Meas. Tech.
Mps-1 Kinase Assay
pH
7.7±n/a
Temperature
295.15±n/a K
IC50
16000±n/a nM
Comments
extracted
Citation
 Bärfacker, LPrechtl, SSiemeister, GWengner, AMAckerstaff, JNowak-Reppel, KBader, BLienau, PStöckigt, DHeinrich, T Amino-substituted isothiazoles US Patent  US9682995 Publication Date 6/20/2017 
Target
Name:
Dual specificity protein kinase TTK
Synonyms:
Dual specificity protein kinase (TTK) MPS1 Monopolar Spindle 1 (MPS1) Monopolar Spindle 1 Kinase (MPS1) TTK | TTK_HUMAN
Type:
Protein
Mol. Mass.:
97086.79
Organism:
Homo sapiens (Human)
Description:
P33981
Residue:
857
  
Inhibitor
Name:
BDBM162179
Synonyms:
US9682995, 78
Type:
Small organic molecule
Emp. Form.:
C17H16F2N6OS
Mol. Mass.:
390.41
SMILES:
CCNc1cncc(Nc2snc(C)c2C(=O)Nc2ccc(F)c(F)c2)n1
: