Target
DNA topoisomerase I/type IB small subunit
Ligand
BDBM246591
Substrate
Meas. Tech.
Stimultaneous Relaxation Assay
pH
7.5±n/a
IC50
5.1e+4± 9.23e+3 nM
Comments
extracted
Citation
 Sharma, GChowdhury, SSinha, SMajumder, HKKumar, SV Antileishmanial activity evaluation of bis-lawsone analogs and DNA topoisomerase-I inhibition studies. J Enzyme Inhib Med Chem 29:185-9 (2014)  
Target
Name:
DNA topoisomerase I/type IB small subunit
Synonyms:
DNA topoisomerase IB
Type:
Protein
Mol. Mass.:
Description:
Bi-subunit type IB topoisomerase
Components:
This complex has 2 components.
Component 1
Name:
DNA topoisomerase type IB small subunit
Synonyms:
DNA topoisomerase IB small subunit
Type:
Protein
Mol. Mass.:
28120.90
Organism:
Leishmania donovani
Description:
E9B7X3
Residue:
262
  
Component 2
Name:
DNA topoisomerase I
Synonyms:
DNA topoisomerase IB large subunit
Type:
Protein
Mol. Mass.:
73610.41
Organism:
Leishmania donovani
Description:
E9BRC0
Residue:
635
  
Inhibitor
Name:
BDBM246591
Synonyms:
Bi-lawsone analog, 3a
Type:
Small organic molecule
Emp. Form.:
C27H16O6
Mol. Mass.:
436.4123
SMILES:
OC1=C(C(C2=C(O)C(=O)c3ccccc3C2=O)c2ccccc2)C(=O)c2ccccc2C1=O
: