Target
DNA topoisomerase I/type IB small subunit
Ligand
BDBM246593
Substrate
Meas. Tech.
Stimultaneous Relaxation Assay
pH
7.5±n/a
IC50
7.4e+4± 1.34e+4 nM
Comments
extracted
Citation
 Sharma, GChowdhury, SSinha, SMajumder, HKKumar, SV Antileishmanial activity evaluation of bis-lawsone analogs and DNA topoisomerase-I inhibition studies. J Enzyme Inhib Med Chem 29:185-9 (2014)  
Target
Name:
DNA topoisomerase I/type IB small subunit
Synonyms:
DNA topoisomerase IB
Type:
Protein
Mol. Mass.:
Description:
Bi-subunit type IB topoisomerase
Components:
This complex has 2 components.
Component 1
Name:
DNA topoisomerase type IB small subunit
Synonyms:
DNA topoisomerase IB small subunit
Type:
Protein
Mol. Mass.:
28120.90
Organism:
Leishmania donovani
Description:
E9B7X3
Residue:
262
  
Component 2
Name:
DNA topoisomerase I
Synonyms:
DNA topoisomerase IB large subunit
Type:
Protein
Mol. Mass.:
73610.41
Organism:
Leishmania donovani
Description:
E9BRC0
Residue:
635
  
Inhibitor
Name:
BDBM246593
Synonyms:
Bi-lawsone analog, 3c
Type:
Small organic molecule
Emp. Form.:
C28H18O8
Mol. Mass.:
482.4377
SMILES:
COc1cc(ccc1O)C(C1=C(O)C(=O)c2ccccc2C1=O)C1=C(O)C(=O)c2ccccc2C1=O
: