Target
Transient receptor potential M8 protein
Ligand
BDBM248414
Substrate
Meas. Tech.
Functional Assay
Temperature
310.15±n/a K
IC50
1±n/a nM
Comments
extracted
Citation
 Branum, STColburn, RWDax, SLFlores, CMJetter, MCLiu, YLudovici, DMacielag, MJMatthews, JMMcNally, JJAndraka, LMRussell, RKQin, NTeleha, CWells, KMYouells, SCYoungman, MA Sulfonamides as TRPM8 modulators US Patent  US9434711 Publication Date 9/6/2016 
Target
Name:
Transient receptor potential M8 protein
Synonyms:
Cold-menthol receptor (TRPM8) Transient receptor potential M8 protein Transient receptor potential melastatin subfamily, type 8 (TRPM8)
Type:
Enzyme
Mol. Mass.:
127589.43
Organism:
Canis lupus familiaris (Dog)
Description:
Q1A7N1
Residue:
1104
  
Inhibitor
Name:
BDBM248414
Synonyms:
US9434711, 278
Type:
Small organic molecule
Emp. Form.:
C26H26BrNO4S2
Mol. Mass.:
560.523
SMILES:
OC(=O)c1ccc(cc1)S(=O)(=O)N(CC12CC3CC(CC(C3)C1)C2)c1sc2ccccc2c1Br
: