Target
Transient receptor potential M8 protein
Ligand
BDBM248840
Substrate
Meas. Tech.
Functional Assay
Temperature
310.15±n/a K
IC50
1±n/a nM
Comments
extracted
Citation
 Branum, STColburn, RWDax, SLFlores, CMJetter, MCLiu, YLudovici, DMacielag, MJMatthews, JMMcNally, JJAndraka, LMRussell, RKQin, NTeleha, CWells, KMYouells, SCYoungman, MA Sulfonamides as TRPM8 modulators US Patent  US9434711 Publication Date 9/6/2016 
Target
Name:
Transient receptor potential M8 protein
Synonyms:
Cold-menthol receptor (TRPM8) Transient receptor potential M8 protein Transient receptor potential melastatin subfamily, type 8 (TRPM8)
Type:
Enzyme
Mol. Mass.:
127589.43
Organism:
Canis lupus familiaris (Dog)
Description:
Q1A7N1
Residue:
1104
  
Inhibitor
Name:
BDBM248840
Synonyms:
US9434711, 810
Type:
Small organic molecule
Emp. Form.:
C25H18F3N3O4S3
Mol. Mass.:
577.618
SMILES:
Cc1c(sc2ccccc12)N(Cc1ccc(OC(F)(F)F)cc1)S(=O)(=O)c1ccc(cc1)-c1nsc(=O)[nH]1
: