Target
Glycogen synthase kinase-3 alpha
Ligand
BDBM256611
Substrate
Meas. Tech.
Enzyme Inhibition Assay
IC50
10284±n/a nM
Citation
 Baker, TMFyfe, MCHarbottle, GWHasimbegovic, VMeghani, PRigby, ASambrook-Smith, CThom, SM Kinase inhibitors US Patent  US9481648 Publication Date 11/1/2016 
Target
Name:
Glycogen synthase kinase-3 alpha
Synonyms:
GSK-3 alpha GSK3A_HUMAN Glycogen synthase kinase-3 Glycogen synthase kinase-3 alpha (GSK3 Alpha) Glycogen synthase kinase-3 alpha (GSK3alpha)
Type:
Enzyme
Mol. Mass.:
50991.79
Organism:
Homo sapiens (Human)
Description:
P49840
Residue:
483
  
Inhibitor
Name:
BDBM256611
Synonyms:
US10435361, Example 85(m) US9790174, Example 85(m)
Type:
Small organic molecule
Emp. Form.:
C44H53N7O8S
Mol. Mass.:
839.999
SMILES:
COc1cc(Nc2cc(Oc3ccc(NC(=O)Nc4cc(cc(NS(C)(=O)=O)c4OC)C(C)(C)C)c4ccccc34)ccn2)cc(c1)C(=O)NCCN1CCOC(C)(C)C1
: