Target
Beta-secretase 1 [1-454]
Ligand
BDBM150707
Substrate
Meas. Tech.
Fluorescence Quench Assay
pH
4.4±n/a
IC50
5±n/a nM
Comments
extracted
Citation
 Bukhtiyarov, YCacatian, SDillard, LWDorner-Ciossek, CFuchs, KJia, LLala, DSMorales-Ramos, AReeves, JSingh, SBVenkatraman, SXu, ZYuan, JZhao, YZheng, YRast, G Inhibitors of beta-secretase US Patent  US9526727 Publication Date 12/27/2016 
Target
Name:
Beta-secretase 1 [1-454]
Synonyms:
BACE BACE1_HUMAN KIAA1149
Type:
Protein
Mol. Mass.:
50294.92
Organism:
Homo sapiens (Human)
Description:
Human BACE1 truncation (1-454 aa)
Residue:
454
  
Inhibitor
Name:
BDBM150707
Synonyms:
US8981112, 14 US9949975, Example 14
Type:
Small organic molecule
Emp. Form.:
C25H32N4O3
Mol. Mass.:
436.5466
SMILES:
CO[C@@H]1[C@@H](C)C[C@]2(Cc3ccc(cc3[C@]22N=C(N)N(C[C@H]3CCCO3)C2=O)C#N)C[C@H]1C
: