Target
Glutathione S-transferase P/Mucosa-associated lymphoid tissue lymphoma translocation protein 1
Ligand
BDBM260162
Substrate
Meas. Tech.
In Vitro Protease Cleavage Assay
Temperature
303.15±n/a K
IC50
5700±n/a nM
Comments
extracted
Citation
 Krappmann, DNagel, DSchendel, DSpranger, S Selective inhibition of MALT1 protease by phenothiazine derivatives US Patent  US9504692 Publication Date 11/29/2016 
Target
Name:
Glutathione S-transferase P/Mucosa-associated lymphoid tissue lymphoma translocation protein 1
Synonyms:
GST-MALT lymphoma-associated translocation (MALT1)
Type:
Enzyme
Mol. Mass.:
Description:
Components:
This complex has 2 components.
Component 1
Name:
Glutathione S-transferase P
Synonyms:
FAEES3 GST3 GSTP1-1 Glutathione S-transferase Glutathione S-transferase P Glutathione transferase (GST)
Type:
Enzyme
Mol. Mass.:
23353.53
Organism:
Homo sapiens (Human)
Description:
P09211
Residue:
210
  
Component 2
Name:
Mucosa-associated lymphoid tissue lymphoma translocation protein 1
Synonyms:
MALT lymphoma-associated translocation MALT1 MLT Paracaspase
Type:
Enzyme
Mol. Mass.:
92257.81
Organism:
Homo sapiens (Human)
Description:
Q9UDY8
Residue:
824
  
Inhibitor
Name:
BDBM260162
Synonyms:
US9504692, 3939
Type:
Small organic molecule
Emp. Form.:
C19H24N2S
Mol. Mass.:
312.472
SMILES:
CCN(CC)CCCN1c2ccccc2Sc2ccccc12
: