Target
Lysine-specific demethylase 4C
Ligand
BDBM277737
Substrate
Meas. Tech.
JMJD2C Assay
IC50
550±n/a nM
Citation
 Kanouni, TStafford, JAVeal, JMWallace, MB Histone demethylase inhibitors US Patent  US10336727 Publication Date 7/2/2019 
Target
Name:
Lysine-specific demethylase 4C
Synonyms:
GASC-1 protein Gene amplified in squamous cell carcinoma 1 protein JMJD2C Jumonji domain-containing protein 2C KDM4C_HUMAN | KIAA0780
Type:
Protein
Mol. Mass.:
119979.01
Organism:
Homo sapiens (Human)
Description:
Q9H3R0
Residue:
1056
  
Inhibitor
Name:
BDBM277737
Synonyms:
3-{[5-chloro-1-(cyclopropylmethyl)-1H-indazol-3-yl]amino}pyridine-4-carboxylic acid US10336727, Example 34 | US9617242, Example 34
Type:
Small organic molecule
Emp. Form.:
C17H15ClN4O2
Mol. Mass.:
342.78
SMILES:
OC(=O)c1ccncc1Nc1nn(CC2CC2)c2ccc(Cl)cc12
: