Target
Asialoglycoprotein receptor 1
Ligand
BDBM408859
Substrate
Meas. Tech.
SPR Binding Measurements
Kd
3300±n/a nM
Citation
 Liras, SMascitti, VThuma, B Substituted-6,8-dioxabicyclo[3.2.1]octane-2,3-diol compounds as targeting agents of ASGPR US Patent  US10376531 Publication Date 8/13/2019 
Target
Name:
Asialoglycoprotein receptor 1
Synonyms:
ASGP-R 1 ASGR1 CLEC4H1 | Hepatic lectin H1
Type:
PROTEIN
Mol. Mass.:
33177.60
Organism:
Homo sapiens (Human)
Description:
ChEMBL_603824
Residue:
291
  
Inhibitor
Name:
BDBM408859
Synonyms:
US10376531, Compound 19 | US10813942, Compound 19
Type:
Small organic molecule
Emp. Form.:
C13H23NO6
Mol. Mass.:
289.3248
SMILES:
CCCCOC[C@@]12CO[C@@H](O1)[C@H](NC(C)=O)[C@@H](O)[C@H]2O
: