Target
Neuronal acetylcholine receptor subunit alpha-7
Ligand
BDBM410096
Substrate
Meas. Tech.
Binding Assay
Ki
69.0±n/a nM
Citation
 Acharya, RBurnett, DABursavich, MGCook, ASHarrison, BAMcRiner, AJ Aminobenzisoxazole compounds as agonists of α7-nicotinic acetylcholine receptors US Patent  US10370370 Publication Date 8/6/2019 
Target
Name:
Neuronal acetylcholine receptor subunit alpha-7
Synonyms:
ACHA7_HUMAN Cholinergic, Nicotinic Alpha7 Neuronal acetylcholine receptor protein alpha-7 subunit Nicotinic acetylcholine receptor alpha-7 (alpha7 nAChR)
Type:
Mol. Mass.:
56448.33
Organism:
Homo sapiens (Human)
Description:
CHRNA7 (NACHRA7)
Residue:
502
  
Inhibitor
Name:
BDBM410096
Synonyms:
US10370370, Compound 1-P2
Type:
Small organic molecule
Emp. Form.:
C14H17N3O
Mol. Mass.:
243.3043
SMILES:
C1CN2CCC1[C@@H](C2)Nc1noc2ccccc12
: