Target
5-hydroxytryptamine receptor 3A
Ligand
BDBM410130
Substrate
Meas. Tech.
Competition Binding Assay
Ki
71.0±n/a nM
Citation
 Acharya, RBurnett, DABursavich, MGCook, ASHarrison, BAMcRiner, AJ Aminobenzisoxazole compounds as agonists of α7-nicotinic acetylcholine receptors US Patent  US10370370 Publication Date 8/6/2019 
Target
Name:
5-hydroxytryptamine receptor 3A
Synonyms:
5-HT-3 5-HT3A 5-hydroxytryptamine receptor 3 (5-HT3) 5-hydroxytryptamine receptor 3A (5HT3A) 5HT3R HTR3A Serotonin 3 receptor (5HT3) Serotonin-gated ion channel receptor | Serotonin-gated ion channel receptor 3
Type:
Protein
Mol. Mass.:
55283.27
Organism:
Homo sapiens (Human)
Description:
P46098
Residue:
478
  
Inhibitor
Name:
BDBM410130
Synonyms:
US10370370, Compound (R)-23
Type:
Small organic molecule
Emp. Form.:
C14H16ClN3O2
Mol. Mass.:
293.749
SMILES:
Oc1c(Cl)ccc2c(N[C@H]3CN4CCC3CC4)noc12
: