Target
Neuronal acetylcholine receptor subunit alpha-7
Ligand
BDBM410137
Substrate
Meas. Tech.
Binding Assay
Ki
280±n/a nM
Citation
 Acharya, RBurnett, DABursavich, MGCook, ASHarrison, BAMcRiner, AJ Aminobenzisoxazole compounds as agonists of α7-nicotinic acetylcholine receptors US Patent  US10370370 Publication Date 8/6/2019 
Target
Name:
Neuronal acetylcholine receptor subunit alpha-7
Synonyms:
ACHA7_HUMAN Cholinergic, Nicotinic Alpha7 Neuronal acetylcholine receptor protein alpha-7 subunit Nicotinic acetylcholine receptor alpha-7 (alpha7 nAChR)
Type:
Mol. Mass.:
56448.33
Organism:
Homo sapiens (Human)
Description:
CHRNA7 (NACHRA7)
Residue:
502
  
Inhibitor
Name:
BDBM410137
Synonyms:
US10370370, Compound (R)-30
Type:
Small organic molecule
Emp. Form.:
C15H18ClN3O2
Mol. Mass.:
307.775
SMILES:
COc1ccc2c(N[C@H]3CN4CCC3CC4)noc2c1Cl
: