Target
5-hydroxytryptamine receptor 3A
Ligand
BDBM410151
Substrate
Meas. Tech.
Competition Binding Assay
Ki
980±n/a nM
Citation
 Acharya, RBurnett, DABursavich, MGCook, ASHarrison, BAMcRiner, AJ Aminobenzisoxazole compounds as agonists of α7-nicotinic acetylcholine receptors US Patent  US10370370 Publication Date 8/6/2019 
Target
Name:
5-hydroxytryptamine receptor 3A
Synonyms:
5-HT-3 5-HT3A 5-hydroxytryptamine receptor 3 (5-HT3) 5-hydroxytryptamine receptor 3A (5HT3A) 5HT3R HTR3A Serotonin 3 receptor (5HT3) Serotonin-gated ion channel receptor | Serotonin-gated ion channel receptor 3
Type:
Protein
Mol. Mass.:
55283.27
Organism:
Homo sapiens (Human)
Description:
P46098
Residue:
478
  
Inhibitor
Name:
BDBM410151
Synonyms:
US10370370, Compound (S)-42
Type:
Small organic molecule
Emp. Form.:
C14H15ClFN3O
Mol. Mass.:
295.74
SMILES:
Fc1cc2c(N[C@@H]3CN4CCC3CC4)noc2cc1Cl
: