Target
Type-2 angiotensin II receptor
Ligand
BDBM410295
Substrate
Meas. Tech.
Receptor Binding Assay
Ki
0.898±n/a nM
Citation
 McCarthy, TDNaylor, A Heterocyclic compounds and methods of their use US Patent  US10370388 Publication Date 8/6/2019 
Target
Name:
Type-2 angiotensin II receptor
Synonyms:
AGTR2 AT2 Angiotensin II type 2 (AT-2) receptor Type-2 angiotensin II receptor
Type:
Enzyme Catalytic Domain
Mol. Mass.:
41201.61
Organism:
Homo sapiens (Human)
Description:
Angiotensin II, central 0 0::P50052
Residue:
363
  
Inhibitor
Name:
BDBM410295
Synonyms:
US10370388, Compound Angiotensin
Type:
Small organic molecule
Emp. Form.:
C49H70N14O11
Mol. Mass.:
1031.1673
SMILES:
CC(C)C(NC(=O)C(CCCN=C(N)N)NC(=O)C(N)CC(N)=O)C(=O)NC(Cc1ccc(O)cc1)C(=O)NC(C(C)C)C(=O)NC(Cc1cnc[nH]1)C(=O)N1CCCC1C(=O)NC(Cc1ccccc1)C(O)=O
: