Target
Proto-oncogene tyrosine-protein kinase receptor Ret [658-1114,V804M]
Ligand
BDBM305662
Substrate
Meas. Tech.
RET Enzyme Assay
IC50
5.20±n/a nM
Citation
 Andrews, SWAronow, SBlake, JFBrandhuber, BJCollier, JCook, AHaas, JJiang, YKolakowski, GRMcFaddin, EAMcKenney, MLMcNulty, OTMetcalf, ATMoreno, DARamann, GATang, TPRen, LWalls, SM Substituted pyrazolo[1,5-A]pyridine compounds as RET kinase inhibitors US Patent  US10441581 Publication Date 10/15/2019 
Target
Name:
Proto-oncogene tyrosine-protein kinase receptor Ret [658-1114,V804M]
Synonyms:
CDHF12 PTC Proto-oncogene tyrosine-protein kinase receptor Ret (V804M) RET Kinase (V804M) (aa658-end) RET_HUMAN
Type:
Enzyme Catalytic Domain
Mol. Mass.:
51567.23
Organism:
Homo sapiens (Human)
Description:
P07949[658-1114,V804M]
Residue:
457
  
Inhibitor
Name:
BDBM305662
Synonyms:
US10144734, Example 680 US10441581, Example 680 US11648243, Example 680
Type:
Small organic molecule
Emp. Form.:
C29H28ClFN8O2
Mol. Mass.:
575.036
SMILES:
CC1(CCN(CC1)c1ccc(cn1)-c1cc(OCC2(F)CNC2)cn2ncc(C#N)c12)NC(=O)c1ncccc1Cl
: