Target
Isoform 2 of MAP kinase-interacting serine/threonine-protein kinase 1 (MNK1a) 344D]
Ligand
BDBM420274
Substrate
Meas. Tech.
MKNK1 Kinase High ATP Assay
IC50
<1.000±n/a nM
Citation
 Giese, AKlar, UGraham, KKettschau, GSülzle, DLienau, PPetersen, KLeFranc, JSchmidt, N Pyrazolopyridinamines as MKNK1 and MKNK2 inhibitors US Patent  US10487092 Publication Date 11/26/2019 
Target
Name:
Isoform 2 of MAP kinase-interacting serine/threonine-protein kinase 1 (MNK1a) 344D]
Synonyms:
Isoform 2 of MAP kinase-interacting serine/threonine-protein kinase 1 (MNK1a) 344D] MAP kinase signal-integrating kinase 1 (MNK1) (T344D) MAP kinase-interacting serine/threonine-protein kinase 1 (MKNK1) (T344D) MAP kinase-interacting serine/threonine-protein kinase 1 (MNK1a) [T344D] MKNK1 MKNK1_HUMAN MNK1a
Type:
Protein
Mol. Mass.:
47416.00
Organism:
Homo sapiens (Human)
Description:
Q9BUB5-2 with T344D
Residue:
424
  
Inhibitor
Name:
BDBM420274
Synonyms:
(7S)-4-[(6-Methoxypyrazolo[1,5-a]pyridin-5-yl)amino]-5,6,7,8-tetrahydro[1]benzothieno[2,3-d]pyrimidin-7-yl[(1R,4R)-5-methyl-2,5-diazabicyclo[2.2.1]hept-2-yl]methanone | US10487092, Example 122
Type:
Small organic molecule
Emp. Form.:
C25H27N7O2S
Mol. Mass.:
489.593
SMILES:
COc1cn2nccc2cc1Nc1ncnc2sc3C[C@H](CCc3c12)C(=O)N1C[C@H]2C[C@@H]1CN2C
: