Target
C-X-C chemokine receptor type 2
Ligand
BDBM50115210
Substrate
Meas. Tech.
In Vitro Inhibition of Intracellular Calcium Release
IC50
244±150 nM
Citation
 Maeda, DYZebala, JASchuler, AD Aminopyridinecarboxamides as CXCR2 modulators US Patent  USRE47740 Publication Date 11/26/2019 
Target
Name:
C-X-C chemokine receptor type 2
Synonyms:
C-X-C chemokine receptor type 2 (CXCR-2) CD_antigen=CD182 CXCR-2 CXCR2_HUMAN GRO/MGSA receptor IL-8 receptor type 2 IL8RB | Interleukin-8 receptor B
Type:
Protein
Mol. Mass.:
40767.88
Organism:
Homo sapiens (Human)
Description:
P25025
Residue:
360
  
Inhibitor
Name:
BDBM50115210
Synonyms:
CHEMBL3609011 USRE48547, Compound 19
Type:
Small organic molecule
Emp. Form.:
C19H18BFN4O3
Mol. Mass.:
380.181
SMILES:
CN(Cc1ccc(cc1)B(O)O)c1ncc(cn1)C(=O)Nc1ccc(F)cc1
: