Target
Orf1a protein
Ligand
BDBM50375318
Substrate
Meas. Tech.
No assay is provided
EC50
12200±n/a nM
Citation
 Pillaiyar, TWendt, LLManickam, MEaswaran, M The recent outbreaks of human coronaviruses: A medicinal chemistry perspective. Med Res Rev 0:0 (2020)  
Target
Name:
Orf1a protein
Synonyms:
3C-like proteinase Leader protein Non-structural protein 2 Non-structural protein 4 Non-structural protein 7 Non-structural protein 9 nsp5 | p65 homolog
Type:
Protein
Mol. Mass.:
486041.74
Organism:
MERS-CoV
Description:
A0A1L2E0X0
Residue:
4391
  
Inhibitor
Name:
BDBM50375318
Synonyms:
Fungistat Panlomyc TERCONAZOLE Terazol 3 med.21724, Compound Terconazole
Type:
Small organic molecule
Emp. Form.:
C26H31Cl2N5O3
Mol. Mass.:
532.462
SMILES:
CC(C)N1CCN(CC1)c1ccc(OC[C@H]2CO[C@@](Cn3cncn3)(O2)c2ccc(Cl)cc2Cl)cc1
: