Target
Interstitial collagenase
Ligand
BDBM50453843
Substrate
Meas. Tech.
Inhibition Assay
IC50
>10000±n/a nM
Citation
 Ouvry, GHarris, CSBhurruth-Alcor, Y Benzenesulfonamide compounds, method for synthesizing same, and use thereof in medicine and cosmetics US Patent  US10556883 Publication Date 2/11/2020 
Target
Name:
Interstitial collagenase
Synonyms:
CLG MMP1 Matrix metalloproteinase-1 | Matrix metalloproteinase-1 (MMP-1)
Type:
Enzyme
Mol. Mass.:
54010.26
Organism:
Homo sapiens (Human)
Description:
P03956
Residue:
469
  
Inhibitor
Name:
BDBM50453843
Synonyms:
CHEMBL4210459 | US10556883, Compound 7b
Type:
Small organic molecule
Emp. Form.:
C25H28N4O6S
Mol. Mass.:
512.578
SMILES:
CC(C)C(=O)N1CC(C1)(NS(=O)(=O)c1ccc(OCc2cc(C)nc3ccccc23)cc1)C(=O)NO
: