Target
Interstitial collagenase
Ligand
BDBM430278
Substrate
Meas. Tech.
Inhibition Assay
IC50
>10000±n/a nM
Citation
 Ouvry, GHarris, CSBhurruth-Alcor, Y Benzenesulfonamide compounds, method for synthesizing same, and use thereof in medicine and cosmetics US Patent  US10556883 Publication Date 2/11/2020 
Target
Name:
Interstitial collagenase
Synonyms:
CLG MMP1 Matrix metalloproteinase-1 | Matrix metalloproteinase-1 (MMP-1)
Type:
Enzyme
Mol. Mass.:
54010.26
Organism:
Homo sapiens (Human)
Description:
P03956
Residue:
469
  
Inhibitor
Name:
BDBM430278
Synonyms:
US10556883, Compound 28b
Type:
Small organic molecule
Emp. Form.:
C29H36N6O6S
Mol. Mass.:
596.698
SMILES:
CCN1CCN(CC1)C(=O)N1CC(CC(=O)NO)(C1)NS(=O)(=O)c1ccc(OCc2cc(C)nc3ccccc23)cc1
: