Target
Plasma kallikrein
Ligand
BDBM433367
Substrate
Meas. Tech.
Activity Assay
Ki
75.0±n/a nM
Citation
 Kotian, PLBabu, YSKumar, VSZhang, WVogeti, L Human plasma kallikrein inhibitors US Patent  US10562850 Publication Date 2/18/2020 
Target
Name:
Plasma kallikrein
Synonyms:
Fletcher factor KLKB1 Kallikrein Plasma kallikrein heavy chain Plasma prekallikrein
Type:
Protein
Mol. Mass.:
71391.16
Organism:
Homo sapiens (Human)
Description:
P03952
Residue:
638
  
Inhibitor
Name:
BDBM433367
Synonyms:
US10562850, Compound 17b | US11066360, Compound 17b
Type:
Small organic molecule
Emp. Form.:
C32H33ClFN5O3
Mol. Mass.:
590.088
SMILES:
CO[C@@H]1C[C@@H](N(C1)C(=O)Nc1ccc(Cl)cc1)C(=O)Nc1cc(ccc1F)C(N)(CCC1CC1)c1cccc(c1)C#N
: