Target
Plasma kallikrein
Ligand
BDBM433420
Substrate
Meas. Tech.
Activity Assay
Ki
>100.0±n/a nM
Citation
 Kotian, PLBabu, YSKumar, VSZhang, WVogeti, L Human plasma kallikrein inhibitors US Patent  US10562850 Publication Date 2/18/2020 
Target
Name:
Plasma kallikrein
Synonyms:
Fletcher factor KLKB1 Kallikrein Plasma kallikrein heavy chain Plasma prekallikrein
Type:
Protein
Mol. Mass.:
71391.16
Organism:
Homo sapiens (Human)
Description:
P03952
Residue:
638
  
Inhibitor
Name:
BDBM433420
Synonyms:
US10562850, Compound 76e | US11066360, Compound 76e
Type:
Small organic molecule
Emp. Form.:
C31H34ClFN4O3
Mol. Mass.:
565.078
SMILES:
CO[C@@H]1C[C@@H](N(C1)C(=O)Cc1ccc(Cl)cc1)C(=O)Nc1cc(ccc1F)C(N)(CCC1CC1)c1ccncc1
: