Target
Transient receptor potential cation channel subfamily V member 4
Ligand
BDBM436100
Substrate
Meas. Tech.
FLIPR Assay
IC50
55±n/a nM
Citation
 Brnardic, EJBrooks, CABudzik, BWLawhorn, BGMatthews, JMMcAtee, JJPero, JEBehm, DJ TRPV4 antagonists US Patent  US10590077 Publication Date 3/17/2020 
Target
Name:
Transient receptor potential cation channel subfamily V member 4
Synonyms:
TRPV4 Transient receptor potential cation channel subfamily V member 4 (TRPV4) VROAC
Type:
Enzyme
Mol. Mass.:
98290.10
Organism:
Homo sapiens (Human)
Description:
Q9HBA0
Residue:
871
  
Inhibitor
Name:
BDBM436100
Synonyms:
4-(((3S,4R)-1- ((2-chloro-4- (trifluoromethyl) phenyl)sulfonyl)- 4-hydroxy-4- (hydroxymethyl) pyrrolidin-3- yl)methyl) benzonitrile | US10590077, Example 2
Type:
Small organic molecule
Emp. Form.:
C20H18ClF3N2O4S
Mol. Mass.:
474.881
SMILES:
OC[C@]1(O)CN(C[C@@H]1Cc1ccc(cc1)C#N)S(=O)(=O)c1ccc(cc1Cl)C(F)(F)F
: