Target
Transient receptor potential cation channel subfamily V member 4
Ligand
BDBM436105
Substrate
Meas. Tech.
FLIPR Assay
IC50
5.0±n/a nM
Citation
 Brnardic, EJBrooks, CABudzik, BWLawhorn, BGMatthews, JMMcAtee, JJPero, JEBehm, DJ TRPV4 antagonists US Patent  US10590077 Publication Date 3/17/2020 
Target
Name:
Transient receptor potential cation channel subfamily V member 4
Synonyms:
TRPV4 Transient receptor potential cation channel subfamily V member 4 (TRPV4) VROAC
Type:
Enzyme
Mol. Mass.:
98290.10
Organism:
Homo sapiens (Human)
Description:
Q9HBA0
Residue:
871
  
Inhibitor
Name:
BDBM436105
Synonyms:
4-(((3S,4R)-1- ((2-chloro-4- cyanophenyl) sulfonyl)-4- hydroxy-4- (hydroxymethyl) pyrrolidin-3- yl)methyl)-2- fluorobenzonitrile | US10590077, Example 6
Type:
Small organic molecule
Emp. Form.:
C20H17ClFN3O4S
Mol. Mass.:
449.883
SMILES:
OC[C@]1(O)CN(C[C@@H]1Cc1ccc(C#N)c(F)c1)S(=O)(=O)c1ccc(cc1Cl)C#N
: