Target
Serine/threonine-protein kinase 17A
Ligand
BDBM441858
Substrate
Meas. Tech.
Activity Inhibition Assay
IC50
24.0±n/a nM
Citation
 Lee, KChoi, GLee, NRPark, SJJung, MEKim, SJYang, KLee, J Substituted pyrimidines for preventing or treating cancer and inflammatory diseases US Patent  US10647686 Publication Date 5/12/2020 
Target
Name:
Serine/threonine-protein kinase 17A
Synonyms:
DRAK1 STK17A
Type:
Enzyme Catalytic Domain
Mol. Mass.:
46544.04
Organism:
Homo sapiens (Human)
Description:
gi_109255245
Residue:
414
  
Inhibitor
Name:
BDBM441858
Synonyms:
US10647686, Example (6)
Type:
Small organic molecule
Emp. Form.:
C14H17Cl2N5
Mol. Mass.:
326.224
SMILES:
Cc1ccc(Nc2ncc(Cl)c(NCCCN)n2)cc1Cl
: