Target
Serine/threonine-protein kinase 17A
Ligand
BDBM441863
Substrate
Meas. Tech.
Activity Inhibition Assay
IC50
26.0±n/a nM
Citation
 Lee, KChoi, GLee, NRPark, SJJung, MEKim, SJYang, KLee, J Substituted pyrimidines for preventing or treating cancer and inflammatory diseases US Patent  US10647686 Publication Date 5/12/2020 
Target
Name:
Serine/threonine-protein kinase 17A
Synonyms:
DRAK1 STK17A
Type:
Enzyme Catalytic Domain
Mol. Mass.:
46544.04
Organism:
Homo sapiens (Human)
Description:
gi_109255245
Residue:
414
  
Inhibitor
Name:
BDBM441863
Synonyms:
US10647686, Example (10)
Type:
Small organic molecule
Emp. Form.:
C19H20ClN5O
Mol. Mass.:
369.848
SMILES:
NCCCNc1nc(Nc2ccc(Oc3ccccc3)cc2)ncc1Cl
: